{"text_format":"1","workbook":"xlsx","n_sheets":5,"sheets":["Calculator","Amortization Schedule","Lookups and Dropdowns","TEST formulas","Sheet1"],"not_rendered":{"charts":0,"images":1,"macros":1,"external_links":0,"defined_names":42,"comments":0,"pivot_tables":0},"unopened":[],"bounds":{"document_bytes":16777216,"sheet_cells":100000,"rows_first":2000,"rows_last":500,"rows_between":2000,"halvings":0,"cell_chars":16384,"cell_head_chars":4096},"cells_cut":0,"cells_raw":0,"read":"whole","date_system":"1900"}

{"sheet":"Calculator","index":0,"n_rows":73,"n_cols":13,"rows_kept":73,"cut":false,"hidden":false,"merged":[[69,1,70,12],[6,5,6,8],[5,5,5,8],[67,5,67,9],[65,5,65,9],[50,1,50,4],[23,5,23,11],[22,5,22,11],[7,1,7,12],[8,1,8,12],[13,6,13,9],[15,6,15,9],[17,6,17,9],[47,1,47,5],[61,1,61,3],[62,2,62,6],[62,8,62,11],[61,5,61,6]]}
[]
[]
[]
[]
[]
[null,null,null,null,null,"Mortgage Credit Certificate (MCC)"]
[null,null,null,null,null,"Potential Savings Calculator"]
[null,"This worksheet provides an estimate only of the potential MCC credit amount.  The calculation is based on the terms of the loan, and the actual credit amount a borrower receives depends upon their federal tax liability and other factors."]
[null,"Please consult a tax professional."]
[]
[null,"I. Would my borrower likely benefit from an MCC?"]
[null,"Borrowers must have federal income tax liability to save money with the tax credit. Use the tool below to find their tax liability last year."]
[]
[null,"Most recent tax return year:"]
[]
[null,"What Federal Income Tax Form did they file?"]
[]
[null,{"$f":"IF(ISNA('Lookups and Dropdowns'!B8)=TRUE,\"Total tax reported on line \",\"Total tax reported on line\"&\" \"&'Lookups and Dropdowns'!B8)","v":"Total tax reported on line "},null,null,null,null,null,null,null,null,"(Tax Liability)"]
[]
[null,"What does this number tell me?"]
{"$rows_left_out":54}
{"sheet":"Amortization Schedule","index":1,"n_rows":44,"n_cols":10,"rows_kept":44,"cut":false,"hidden":true,"merged":[[6,2,6,6],[6,8,6,9],[41,1,42,2],[41,3,42,4],[41,5,42,6],[41,7,42,8],[41,9,42,10],[43,1,43,2],[43,3,43,4],[43,5,43,6],[43,7,43,8],[43,9,43,10],[2,1,3,2],[2,3,3,4],[2,5,3,6],[2,7,3,8],[2,9,3,10],[4,1,4,2],[4,3,4,4],[4,5,4,6],[4,7,4,8],[4,9,4,10]]}
[]
[null,"LOAN TERMS:"]
[null,"First Mortgage Loan Amount",null,"Loan Amount of Monthly Payment Loan",null,"Interest Rate",null,"Loan Term (in years)",null,"First Payment Date (mm/dd/yy)"]
[]
[null,{"$f":"Calculator!G29","v":0},null,{"$f":"Calculator!G31","v":0},null,{"$f":"Calculator!G34","v":0},null,{"$f":"Calculator!G36","v":0},null,{"$f":"Calculator!G38","v":"00:00:00"}]
[]
[null,null,"FIRST MORTGAGE",null,null,null,null,"DPA LOAN","POTENTIAL TAX SAVINGS"]
[null,"Year","Beginning Balance","Principal","Interest","Payment","Ending Balance","MPL Interest","MCC Savings","MCC Cumulative Savings"]
[null,1,{"$f":"'TEST formulas'!I2","v":0},{"$f":"'TEST formulas'!N2","v":"-"},{"$f":"'TEST formulas'!O2","v":"-"},{"$f":"'TEST formulas'!Q2","v":"-"},{"$f":"'TEST formulas'!R2","v":"-"},{"$f":"'TEST formulas'!X2","v":"-"},{"$f":"'TEST formulas'!S2","v":"-"},{"$f":"'TEST formulas'!T2","v":"-"}]
[null,{"$f":"B9+1","v":2},{"$f":"'TEST formulas'!I3","v":"-"},{"$f":"'TEST formulas'!N3","v":"-"},{"$f":"'TEST formulas'!O3","v":"-"},{"$f":"'TEST formulas'!Q3","v":"-"},{"$f":"'TEST formulas'!R3","v":"-"},{"$f":"'TEST formulas'!X3","v":"-"},{"$f":"'TEST formulas'!S3","v":"-"},{"$f":"'TEST formulas'!T3","v":"-"}]
[null,{"$f":"B10+1","v":3},{"$f":"'TEST formulas'!I4","v":"-"},{"$f":"'TEST formulas'!N4","v":"-"},{"$f":"'TEST formulas'!O4","v":"-"},{"$f":"'TEST formulas'!Q4","v":"-"},{"$f":"'TEST formulas'!R4","v":"-"},{"$f":"'TEST formulas'!X4","v":"-"},{"$f":"'TEST formulas'!S4","v":"-"},{"$f":"'TEST formulas'!T4","v":"-"}]
[null,4,{"$f":"'TEST formulas'!I5","v":"-"},{"$f":"'TEST formulas'!N5","v":"-"},{"$f":"'TEST formulas'!O5","v":"-"},{"$f":"'TEST formulas'!Q5","v":"-"},{"$f":"'TEST formulas'!R5","v":"-"},{"$f":"'TEST formulas'!X5","v":"-"},{"$f":"'TEST formulas'!S5","v":"-"},{"$f":"'TEST formulas'!T5","v":"-"}]
[null,5,{"$f":"'TEST formulas'!I6","v":"-"},{"$f":"'TEST formulas'!N6","v":"-"},{"$f":"'TEST formulas'!O6","v":"-"},{"$f":"'TEST formulas'!Q6","v":"-"},{"$f":"'TEST formulas'!R6","v":"-"},{"$f":"'TEST formulas'!X6","v":"-"},{"$f":"'TEST formulas'!S6","v":"-"},{"$f":"'TEST formulas'!T6","v":"-"}]
[null,6,{"$f":"'TEST formulas'!I7","v":"-"},{"$f":"'TEST formulas'!N7","v":"-"},{"$f":"'TEST formulas'!O7","v":"-"},{"$f":"'TEST formulas'!Q7","v":"-"},{"$f":"'TEST formulas'!R7","v":"-"},{"$f":"'TEST formulas'!X7","v":"-"},{"$f":"'TEST formulas'!S7","v":"-"},{"$f":"'TEST formulas'!T7","v":"-"}]
[null,7,{"$f":"'TEST formulas'!I8","v":"-"},{"$f":"'TEST formulas'!N8","v":"-"},{"$f":"'TEST formulas'!O8","v":"-"},{"$f":"'TEST formulas'!Q8","v":"-"},{"$f":"'TEST formulas'!R8","v":"-"},{"$f":"'TEST formulas'!X8","v":"-"},{"$f":"'TEST formulas'!S8","v":"-"},{"$f":"'TEST formulas'!T8","v":"-"}]
[null,8,{"$f":"'TEST formulas'!I9","v":"-"},{"$f":"'TEST formulas'!N9","v":"-"},{"$f":"'TEST formulas'!O9","v":"-"},{"$f":"'TEST formulas'!Q9","v":"-"},{"$f":"'TEST formulas'!R9","v":"-"},{"$f":"'TEST formulas'!X9","v":"-"},{"$f":"'TEST formulas'!S9","v":"-"},{"$f":"'TEST formulas'!T9","v":"-"}]
[null,9,{"$f":"'TEST formulas'!I10","v":"-"},{"$f":"'TEST formulas'!N10","v":"-"},{"$f":"'TEST formulas'!O10","v":"-"},{"$f":"'TEST formulas'!Q10","v":"-"},{"$f":"'TEST formulas'!R10","v":"-"},{"$f":"'TEST formulas'!X10","v":"-"},{"$f":"'TEST formulas'!S10","v":"-"},{"$f":"'TEST formulas'!T10","v":"-"}]
[null,10,{"$f":"'TEST formulas'!I11","v":"-"},{"$f":"'TEST formulas'!N11","v":"-"},{"$f":"'TEST formulas'!O11","v":"-"},{"$f":"'TEST formulas'!Q11","v":"-"},{"$f":"'TEST formulas'!R11","v":"-"},{"$f":"'TEST formulas'!X11","v":"-"},{"$f":"'TEST formulas'!S11","v":"-"},{"$f":"'TEST formulas'!T11","v":"-"}]
[null,11,{"$f":"'TEST formulas'!I12","v":"-"},{"$f":"'TEST formulas'!N12","v":"-"},{"$f":"'TEST formulas'!O12","v":"-"},{"$f":"'TEST formulas'!Q12","v":"-"},{"$f":"'TEST formulas'!R12","v":"-"},{"$f":"'TEST formulas'!X12","v":"-"},{"$f":"'TEST formulas'!S12","v":"-"},{"$f":"'TEST formulas'!T12","v":"-"}]
[null,12,{"$f":"'TEST formulas'!I13","v":"-"},{"$f":"'TEST formulas'!N13","v":"-"},{"$f":"'TEST formulas'!O13","v":"-"},{"$f":"'TEST formulas'!Q13","v":"-"},{"$f":"'TEST formulas'!R13","v":"-"},{"$f":"'TEST formulas'!X13","v":"-"},{"$f":"'TEST formulas'!S13","v":"-"},{"$f":"'TEST formulas'!T13","v":"-"}]
{"$rows_left_out":25}
{"sheet":"Lookups and Dropdowns","index":2,"n_rows":25,"n_cols":4,"rows_kept":25,"cut":false,"hidden":true,"merged":[]}
[null,"1040A","1040EZ",1040]
[2013,35,10,61]
[2014,39,12,63]
[2015,46,12,63]
[]
["Year",{"$f":"Calculator!G14","v":0}]
["Form",{"$f":"Calculator!G16","v":0}]
["Line",{"$f":"INDEX($A$1:$D$4,MATCH(B6,$A$1:$A$4,),MATCH(B7,$A$1:$D$1,))","v":{"$error":"#N/A"}}]
[]
[]
[]
[]
[]
[]
[]
[]
[]
[]
["dd_form","dd_year","dd_year"]
["Select Form","Select Year","Select Loan Term"]
{"$rows_left_out":6}
{"sheet":"TEST formulas","index":3,"n_rows":63,"n_cols":26,"rows_kept":63,"cut":false,"hidden":true,"merged":[]}
["Year","Calculating Dates","Date","Payment #",null,null,null,"Year","Beginning Balance","First Payment Date of Year","First Payment #","Final Payment Date of Year","Final Payment of Year #","Cumulative Principal","Cumulative Interest","Cumulative Interest (First Mtg +DPA)","Total Paid (1st Only)","Ending Balance (1st Only)","MCC Savings","Cumulative MCC Savings","Effective Tax Burden By Year","DPA Beginning Balance","DPA Cumulative Principal","DPA Cumulative Interest","DPA Total Paid","DPA Ending Balance"]
[1,"First Payment Date",{"$f":"F4","v":"00:00:00"},1,"# of months until end of year",{"$f":"12-MONTH(F4)","v":11},null,1,{"$f":"$F$8","v":0},{"$f":"F4","v":"00:00:00"},1,{"$f":"DATE(YEAR(J2),MONTH(J2)+F2,DAY(J2))","v":"1900-11-30"},{"$f":"IFERROR(DATEDIF(J2,L2,\"m\")+K2,\"-\")","v":11},{"$f":"IFERROR(CUMPRINC($F$7/12,$F$5,$F$8,K2,M2,0)*-1,\"-\")","v":"-"},{"$f":"IFERROR(CUMIPMT($F$7/12,$F$5,$F$8,K2,M2,0)*-1,\"-\")","v":"-"},{"$f":"IF(OR(X2=\"\",X2=0,X2=\"-\"),O2,IF(X2>0,O2+X2,\"\"))","v":"-"},{"$f":"IFERROR(N2+O2,\"-\")","v":"-"},{"$f":"IFERROR(I2-N2,\"-\")","v":"-"},{"$f":"IFERROR(IF(P2*Calculator!$G$44<2000,P2*Calculator!$G$44,2000),\"-\")","v":"-"},{"$f":"S2","v":"-"},{"$f":"IFERROR(P2-S2,\"-\")","v":"-"},{"$f":"IFERROR(DPA,\"-\")","v":0},{"$f":"IFERROR(CUMPRINC(Rate/12,120,DPA,K2,M2,0)*-1,\"-\")","v":"-"},{"$f":"IFERROR(CUMIPMT(Rate/12,120,DPA,K2,M2,0)*-1,\"-\")","v":"-"},{"$f":"IFERROR(W2+X2,\"-\")","v":"-"},{"$f":"IFERROR(V2-W2,0)","v":0}]
[null,"Last Payment Date in That Year",{"$f":"DATE(YEAR(C2),MONTH(C2)+F2,DAY(C2))","v":"1900-11-30"},{"$f":"D2+DATEDIF(C2,C3,\"m\")","v":11},"# of payments left in the year",{"$f":"13-MONTH(F4)","v":12},null,2,{"$f":"IF(R2>0,IFERROR(R2,\"-\"),\"-\")","v":"-"},{"$f":"IF(L2=\"\",\"\",IF(DATE(YEAR(L2),MONTH(L2)+1,DAY(L2))<=$F$6,DATE(YEAR(L2),MONTH(L2)+1,DAY(L2)),IF(DATE(YEAR(L2),MONTH(L2)+1,DAY(L2))=$F$6,$F$6,\"\")))","v":{"$error":"#NUM!"}},{"$f":"IFERROR(DATEDIF(L2,J3,\"m\")+M2,\"-\")","v":"-"},{"$f":"IF(J3=\"\",\"\",IF(DATE(YEAR(J3),MONTH(J3)+11,DAY(J3))<$F$6,DATE(YEAR(J3),MONTH(J3)+11,DAY(J3)),IF(DATE(YEAR(J3),MONTH(J3)+11,DAY(J3))>=$F$6,$F$6,\"\")))","v":{"$error":"#NUM!"}},{"$f":"IFERROR(DATEDIF(J3,L3,\"m\")+K3,\"-\")","v":"-"},"-",{"$f":"IFERROR(CUMIPMT($F$7/12,$F$5,$F$8,K3,M3,0)*-1,\"-\")","v":"-"},{"$f":"IF(OR(X3=\"\",X3=0,X3=\"-\"),O3,IF(X3>0,O3+X3,\"\"))","v":"-"},{"$f":"IFERROR(N3+O3,\"-\")","v":"-"},{"$f":"IFERROR(I3-N3,\"-\")","v":"-"},{"$f":"IFERROR(IF(P3*Calculator!$G$44<2000,P3*Calculator!$G$44,2000),\"-\")","v":"-"},{"$f":"IFERROR(T2+S3,\"-\")","v":"-"},{"$f":"IFERROR(P3-S3,\"-\")","v":"-"},{"$f":"IFERROR(Z2,\"-\")","v":0},"-","-",{"$f":"IFERROR(W3+X3,\"-\")","v":"-"},0]
[2,"First Payment Date of the Year",{"$f":"IF(C3=\"\",\"\",IF(DATE(YEAR(C3),MONTH(C3)+1,DAY(C3))<=$F$6,DATE(YEAR(C3),MONTH(C3)+1,DAY(C3)),IF(DATE(YEAR(C3),MONTH(C3)+1,DAY(C3))=$F$6,$F$6,\"\")))","v":{"$error":"#NUM!"}},{"$f":"D3+DATEDIF(C3,C4,\"m\")","v":{"$error":"#NUM!"}},"First Payment Date",{"$f":"FPD","v":"00:00:00"},null,3,{"$f":"IF(R3>0,IFERROR(R3,\"-\"),\"-\")","v":"-"},{"$error":"#NUM!"},{"$f":"IFERROR(DATEDIF(L3,J4,\"m\")+M3,\"-\")","v":"-"},{"$error":"#NUM!"},"-","-","-","-",{"$f":"IFERROR(N4+O4,\"-\")","v":"-"},"-",{"$f":"IFERROR(IF(P4*Calculator!$G$44<2000,P4*Calculator!$G$44,2000),\"-\")","v":"-"},{"$f":"IFERROR(T3+S4,\"-\")","v":"-"},"-",{"$f":"IFERROR(Z3,\"-\")","v":0},"-","-","-",0]
[null,"Last Payment Date in That Year",{"$f":"IF(C4=\"\",\"\",IF(DATE(YEAR(C4),MONTH(C4)+11,DAY(C4))<$F$6,DATE(YEAR(C4),MONTH(C4)+11,DAY(C4)),IF(DATE(YEAR(C4),MONTH(C4)+11,DAY(C4))>=$F$6,$F$6,\"\")))","v":{"$error":"#NUM!"}},{"$f":"D4+DATEDIF(C4,C5,\"m\")","v":{"$error":"#NUM!"}},"Loan Term",{"$f":"Term*12","v":0},null,4,"-",{"$error":"#NUM!"},"-",{"$error":"#NUM!"},"-","-","-","-","-","-",{"$f":"IFERROR(IF(P5*Calculator!$G$44<2000,P5*Calculator!$G$44,2000),\"-\")","v":"-"},"-","-",0,"-","-","-",0]
[3,"First Payment Date of the Year",{"$f":"IF(C5=\"\",\"\",IF(DATE(YEAR(C5),MONTH(C5)+1,DAY(C5))<=$F$6,DATE(YEAR(C5),MONTH(C5)+1,DAY(C5)),IF(DATE(YEAR(C5),MONTH(C5)+1,DAY(C5))=$F$6,$F$6,\"\")))","v":{"$error":"#NUM!"}},{"$f":"D5+DATEDIF(C5,C6,\"m\")","v":{"$error":"#NUM!"}},"Maturity Date",{"$f":"DATE(YEAR(F4),MONTH(F4) + (F5 - 1), DAY(F4))","v":{"$error":"#NUM!"}},null,5,"-",{"$error":"#NUM!"},"-",{"$error":"#NUM!"},"-","-","-","-","-","-",{"$f":"IFERROR(IF(P6*Calculator!$G$44<2000,P6*Calculator!$G$44,2000),\"-\")","v":"-"},"-","-",0,"-","-","-",0]
[null,"Last Payment Date in That Year",{"$f":"IF(C6=\"\",\"\",IF(DATE(YEAR(C6),MONTH(C6)+11,DAY(C6))<$F$6,DATE(YEAR(C6),MONTH(C6)+11,DAY(C6)),IF(DATE(YEAR(C6),MONTH(C6)+11,DAY(C6))>=$F$6,$F$6,\"\")))","v":{"$error":"#NUM!"}},{"$error":"#NUM!"},"Rate",{"$f":"Rate","v":0},null,6,"-",{"$error":"#NUM!"},"-",{"$error":"#NUM!"},"-","-","-","-","-","-",{"$f":"IFERROR(IF(P7*Calculator!$G$44<2000,P7*Calculator!$G$44,2000),\"-\")","v":"-"},"-","-",0,"-","-","-",0]
[4,"First Payment Date of the Year",{"$f":"IF(C7=\"\",\"\",IF(DATE(YEAR(C7),MONTH(C7)+1,DAY(C7))<=$F$6,DATE(YEAR(C7),MONTH(C7)+1,DAY(C7)),IF(DATE(YEAR(C7),MONTH(C7)+1,DAY(C7))=$F$6,$F$6,\"\")))","v":{"$error":"#NUM!"}},{"$error":"#NUM!"},"Loan Amount",{"$f":"FMA","v":0},null,7,"-",{"$error":"#NUM!"},"-",{"$error":"#NUM!"},"-","-","-","-","-","-",{"$f":"IFERROR(IF(P8*Calculator!$G$44<2000,P8*Calculator!$G$44,2000),\"-\")","v":"-"},"-","-",0,"-","-","-",0]
[null,"Last Payment Date in That Year",{"$f":"IF(C8=\"\",\"\",IF(DATE(YEAR(C8),MONTH(C8)+11,DAY(C8))<$F$6,DATE(YEAR(C8),MONTH(C8)+11,DAY(C8)),IF(DATE(YEAR(C8),MONTH(C8)+11,DAY(C8))>=$F$6,$F$6,\"\")))","v":{"$error":"#NUM!"}},{"$error":"#NUM!"},"DPA Amount",{"$f":"DPA","v":0},null,8,"-",{"$error":"#NUM!"},"-",{"$error":"#NUM!"},"-","-","-","-","-","-",{"$f":"IFERROR(IF(P9*Calculator!$G$44<2000,P9*Calculator!$G$44,2000),\"-\")","v":"-"},"-","-",0,"-","-","-",0]
[5,"First Payment Date of the Year",{"$f":"IF(C9=\"\",\"\",IF(DATE(YEAR(C9),MONTH(C9)+1,DAY(C9))<=$F$6,DATE(YEAR(C9),MONTH(C9)+1,DAY(C9)),IF(DATE(YEAR(C9),MONTH(C9)+1,DAY(C9))=$F$6,$F$6,\"\")))","v":{"$error":"#NUM!"}},{"$error":"#NUM!"},"Effective Tax Burden Over 2nd Full Year of Payments",{"$f":"U33","v":0},null,9,"-",{"$error":"#NUM!"},"-",{"$error":"#NUM!"},"-","-","-","-","-","-",{"$f":"IFERROR(IF(P10*Calculator!$G$44<2000,P10*Calculator!$G$44,2000),\"-\")","v":"-"},"-","-",0,"-","-","-",0]
[null,"Last Payment Date in That Year",{"$f":"IF(C10=\"\",\"\",IF(DATE(YEAR(C10),MONTH(C10)+11,DAY(C10))<$F$6,DATE(YEAR(C10),MONTH(C10)+11,DAY(C10)),IF(DATE(YEAR(C10),MONTH(C10)+11,DAY(C10))>=$F$6,$F$6,\"\")))","v":{"$error":"#NUM!"}},{"$error":"#NUM!"},"Effective Interest Rate",3.03628043887673E-2,null,10,"-",{"$error":"#NUM!"},"-",{"$error":"#NUM!"},"-","-","-","-","-","-",{"$f":"IFERROR(IF(P11*Calculator!$G$44<2000,P11*Calculator!$G$44,2000),\"-\")","v":"-"},"-","-",0,"-","-","-",0]
[6,"First Payment Date of the Year",{"$f":"IF(C11=\"\",\"\",IF(DATE(YEAR(C11),MONTH(C11)+1,DAY(C11))<=$F$6,DATE(YEAR(C11),MONTH(C11)+1,DAY(C11)),IF(DATE(YEAR(C11),MONTH(C11)+1,DAY(C11))=$F$6,$F$6,\"\")))","v":{"$error":"#NUM!"}},{"$error":"#NUM!"},"Formula for Goal Seek",{"$f":"IF(F5=360,CUMIPMT(F11/12,F5,F8,1,360,0)*-1,IF(F5=180,CUMIPMT(F11/12,F5,F8,1,180,0)*-1,\"\"))","v":""},null,11,"-",{"$error":"#NUM!"},"-",{"$error":"#NUM!"},"-","-","-","-","-","-",{"$f":"IFERROR(IF(P12*Calculator!$G$44<2000,P12*Calculator!$G$44,2000),\"-\")","v":"-"},"-","-",0,"-","-","-",0]
[null,"Last Payment Date in That Year",{"$f":"IF(C12=\"\",\"\",IF(DATE(YEAR(C12),MONTH(C12)+11,DAY(C12))<$F$6,DATE(YEAR(C12),MONTH(C12)+11,DAY(C12)),IF(DATE(YEAR(C12),MONTH(C12)+11,DAY(C12))>=$F$6,$F$6,\"\")))","v":{"$error":"#NUM!"}},{"$error":"#NUM!"},"Estimated First Year's Interest Amount",{"$f":"IFERROR(IF(AND(Term=30,DPA>0),(CUMIPMT(Rate/12,Term*12,FMA,1,Calculator!$G$40,0)*-1)+(CUMIPMT(Rate/12,120,DPA,1,Calculator!$G$40,0)*-1),IF(AND(Term=30,OR(DPA=0,DPA=\"\")),(CUMIPMT(Rate/12,Term*12,FMA,1,Calculator!$G$40,0)*-1),IF(AND(Term=15,DPA>0),(CUMIPMT(Rate/12,Term*12,FMA,1,Calculator!$G$40,0)*-1)+(CUMIPMT(Rate/12,120,DPA,1,Calculator!$G$40,0)*-1),IF(AND(Term=15,OR(DPA=0,DPA=\"\")),(CUMIPMT(Rate/12,Term*12,FMA,1,Calculator!$G$40,0)*-1),\"\")))),\"-\")","v":""},null,12,"-",{"$error":"#NUM!"},"-",{"$error":"#NUM!"},"-","-","-","-","-","-",{"$f":"IFERROR(IF(P13*Calculator!$G$44<2000,P13*Calculator!$G$44,2000),\"-\")","v":"-"},"-","-",0,"-","-","-",0]
[7,"First Payment Date of the Year",{"$f":"IF(C13=\"\",\"\",IF(DATE(YEAR(C13),MONTH(C13)+1,DAY(C13))<=$F$6,DATE(YEAR(C13),MONTH(C13)+1,DAY(C13)),IF(DATE(YEAR(C13),MONTH(C13)+1,DAY(C13))=$F$6,$F$6,\"\")))","v":{"$error":"#NUM!"}},{"$error":"#NUM!"},"Estimated Second Year's Interest Amount",{"$f":"IFERROR(IF(AND(Term=30,DPA>0),(CUMIPMT(Rate/12,Term*12,FMA,NFYP+1,NFYP+12,0)*-1)+(CUMIPMT(Rate/12,120,DPA,NFYP+1,NFYP+12,0)*-1),IF(AND(Term=30,OR(DPA=0,DPA=\"\")),(CUMIPMT(Rate/12,Term*12,FMA,NFYP+1,NFYP+12,0)*-1),IF(AND(Term=15,DPA>0),(CUMIPMT(Rate/12,Term*12,FMA,NFYP+1,NFYP+12,0)*-1)+(CUMIPMT(Rate/12,120,DPA,NFYP+1,NFYP+12,0)*-1),IF(AND(Term=15,OR(DPA=0,DPA=\"\")),(CUMIPMT(Rate/12,Term*12,FMA,NFYP+1,NFYP+12,0)*-1),\"\")))),\"-\")","v":""},null,13,"-",{"$error":"#NUM!"},"-",{"$error":"#NUM!"},"-","-","-","-","-","-",{"$f":"IFERROR(IF(P14*Calculator!$G$44<2000,P14*Calculator!$G$44,2000),\"-\")","v":"-"},"-","-",0,"-","-","-",0]
[null,"Last Payment Date in That Year",{"$f":"IF(C14=\"\",\"\",IF(DATE(YEAR(C14),MONTH(C14)+11,DAY(C14))<$F$6,DATE(YEAR(C14),MONTH(C14)+11,DAY(C14)),IF(DATE(YEAR(C14),MONTH(C14)+11,DAY(C14))>=$F$6,$F$6,\"\")))","v":{"$error":"#NUM!"}},{"$error":"#NUM!"},"Monthly Payment",{"$f":"IF(F5=360,PMT(F7/12,360,F8)*-1,IF(F5=180,PMT(F7/12,180,F8)*-1,\"\"))","v":""},null,14,"-",{"$error":"#NUM!"},"-",{"$error":"#NUM!"},"-","-","-","-","-","-",{"$f":"IFERROR(IF(P15*Calculator!$G$44<2000,P15*Calculator!$G$44,2000),\"-\")","v":"-"},"-","-",0,"-","-","-",0]
[8,"First Payment Date of the Year",{"$f":"IF(C15=\"\",\"\",IF(DATE(YEAR(C15),MONTH(C15)+1,DAY(C15))<=$F$6,DATE(YEAR(C15),MONTH(C15)+1,DAY(C15)),IF(DATE(YEAR(C15),MONTH(C15)+1,DAY(C15))=$F$6,$F$6,\"\")))","v":{"$error":"#NUM!"}},{"$error":"#NUM!"},null,null,null,15,"-",{"$error":"#NUM!"},"-",{"$error":"#NUM!"},"-","-","-","-","-","-",{"$f":"IFERROR(IF(P16*Calculator!$G$44<2000,P16*Calculator!$G$44,2000),\"-\")","v":"-"},"-","-",0,"-","-","-",0]
[null,"Last Payment Date in That Year",{"$f":"IF(C16=\"\",\"\",IF(DATE(YEAR(C16),MONTH(C16)+11,DAY(C16))<$F$6,DATE(YEAR(C16),MONTH(C16)+11,DAY(C16)),IF(DATE(YEAR(C16),MONTH(C16)+11,DAY(C16))>=$F$6,$F$6,\"\")))","v":{"$error":"#NUM!"}},{"$error":"#NUM!"},null,{"$f":"CUMIPMT('TEST formulas'!F7/12,'TEST formulas'!F5,'TEST formulas'!F8,1,'TEST formulas'!F5,0)*-1","v":{"$error":"#NUM!"}},null,16,"-",{"$error":"#NUM!"},"-",{"$error":"#NUM!"},"-","-","-","-","-","-",{"$f":"IFERROR(IF(P17*Calculator!$G$44<2000,P17*Calculator!$G$44,2000),\"-\")","v":"-"},"-","-",0,"-","-","-",0]
[9,"First Payment Date of the Year",{"$f":"IF(C17=\"\",\"\",IF(DATE(YEAR(C17),MONTH(C17)+1,DAY(C17))<=$F$6,DATE(YEAR(C17),MONTH(C17)+1,DAY(C17)),IF(DATE(YEAR(C17),MONTH(C17)+1,DAY(C17))=$F$6,$F$6,\"\")))","v":{"$error":"#NUM!"}},{"$error":"#NUM!"},null,null,null,17,"-",{"$error":"#NUM!"},"-",{"$error":"#NUM!"},"-","-","-","-","-","-",{"$f":"IFERROR(IF(P18*Calculator!$G$44<2000,P18*Calculator!$G$44,2000),\"-\")","v":"-"},"-","-",0,"-","-","-",0]
[null,"Last Payment Date in That Year",{"$f":"IF(C18=\"\",\"\",IF(DATE(YEAR(C18),MONTH(C18)+11,DAY(C18))<$F$6,DATE(YEAR(C18),MONTH(C18)+11,DAY(C18)),IF(DATE(YEAR(C18),MONTH(C18)+11,DAY(C18))>=$F$6,$F$6,\"\")))","v":{"$error":"#NUM!"}},{"$error":"#NUM!"},null,null,null,18,"-",{"$error":"#NUM!"},"-",{"$error":"#NUM!"},"-","-","-","-","-","-",{"$f":"IFERROR(IF(P19*Calculator!$G$44<2000,P19*Calculator!$G$44,2000),\"-\")","v":"-"},"-","-",0,"-","-","-",0]
[10,"First Payment Date of the Year",{"$f":"IF(C19=\"\",\"\",IF(DATE(YEAR(C19),MONTH(C19)+1,DAY(C19))<=$F$6,DATE(YEAR(C19),MONTH(C19)+1,DAY(C19)),IF(DATE(YEAR(C19),MONTH(C19)+1,DAY(C19))=$F$6,$F$6,\"\")))","v":{"$error":"#NUM!"}},{"$error":"#NUM!"},null,null,null,19,"-",{"$error":"#NUM!"},"-",{"$error":"#NUM!"},"-","-","-","-","-","-",{"$f":"IFERROR(IF(P20*Calculator!$G$44<2000,P20*Calculator!$G$44,2000),\"-\")","v":"-"},"-","-",0,"-","-","-",0]
{"$rows_left_out":44}
{"sheet":"Sheet1","index":4,"n_rows":0,"n_cols":0,"rows_kept":0,"cut":false,"hidden":false,"merged":[]}