{"text_format":"1","workbook":"xlsx","n_sheets":7,"sheets":["Project Description","Property Information","Housing Income","Controls","NameRanges","Drop Down List Values","Extract Values"],"not_rendered":{"charts":0,"images":0,"macros":1,"external_links":1,"defined_names":834,"comments":3,"pivot_tables":0},"unopened":[],"bounds":{"document_bytes":16777216,"sheet_cells":100000,"rows_first":2000,"rows_last":500,"rows_between":2000,"halvings":0,"cell_chars":16384,"cell_head_chars":4096},"cells_cut":0,"cells_raw":0,"read":"whole","date_system":"1900"}

{"sheet":"Project Description","index":0,"n_rows":33,"n_cols":12,"rows_kept":33,"cut":false,"hidden":false,"merged":[[28,0,28,13],[31,1,31,6],[30,1,30,6],[0,0,1,13],[3,0,3,2],[3,3,3,5],[3,12,3,13],[3,7,3,11],[24,8,24,13],[25,1,25,6],[25,9,25,13],[26,1,26,6],[26,9,26,13],[22,8,22,13],[21,8,21,13],[10,12,10,13],[32,1,32,6],[23,1,23,6],[23,8,23,13],[24,1,24,6],[5,8,5,11],[22,1,22,6],[18,3,18,6],[20,0,20,13],[21,1,21,6],[10,3,10,4],[17,3,17,6],[14,3,14,7],[13,3,13,10],[12,3,12,10],[15,3,15,7],[16,3,16,6],[4,8,4,11],[4,12,4,13],[8,3,8,4],[9,3,9,4],[9,12,9,13],[7,0,7,13]]}
["PROJECT DESCRIPTION"]
[]
[]
["Application Date",null,null,null,null,null,null,"MINNESOTA HOUSING USE ONLY:"]
[null,null,null,null,null,null,null,"Version Date"]
[null,null,null,null,null,null,null,"Version"]
[]
["DEVELOPMENT LOCATION"]
["Property Number (D#):"]
["Project Number (M#):",null,null,null,null,"Only enter one Project Number."]
["HTC #"]
[]
["Development Name",null,null,null,null,null,null,null,null,null,null,"Year Built"]
["Primary Address"]
["City"]
["Zip Code"]
["County"]
["Latitude",null,null,null,null,null,null,"Enter the property's latitude."]
["Longitude",null,null,null,null,null,null,"Enter the property's longitude."]
[]
{"$rows_left_out":14}
{"sheet":"Property Information","index":1,"n_rows":62,"n_cols":12,"rows_kept":62,"cut":false,"hidden":false,"merged":[[66,4,66,8],[6,0,7,0],[57,3,57,8],[58,3,58,8],[39,6,39,7],[40,6,40,7],[54,3,54,8],[55,3,55,8],[56,3,56,8],[61,4,61,8],[62,4,62,8],[63,4,63,8],[64,4,64,8],[65,4,65,8]]}
[null,"PROPERTY INFORMATION"]
["SITE DESCRIPTION"]
["Acres"]
["Total Site Area Sq. Footage",{"$f":"IF(ISBLANK(B3), 0, B3*43560)","v":0}]
["Density (units/acre)",{"$f":"IF(OR(ISBLANK(B3), B3=0), 0,E19/ B3)","v":0}]
[]
["Is  the project is sponsored by a tribal government, tribally designated housing entity or tribal corporate entity?"]
[]
[]
["Is the project located in a qualified census tract?"]
[]
["BUILDING DESCRIPTION"]
[]
["Housing Space","Type of Building","Number of Residential Buildings","Number of Stories","Number of Units","Gross Sq Feet"]
["New Construction"]
[]
[]
[]
["Totals",null,{"$f":"SUM(C15:C18)","v":0},{"$f":"SUM(D15:D18)","v":0},{"$f":"SUM(E15:E18)","v":0},{"$f":"SUM(F15:F18)","v":0}]
[]
{"$rows_left_out":43}
{"sheet":"Housing Income","index":2,"n_rows":52,"n_cols":25,"rows_kept":52,"cut":false,"hidden":false,"merged":[[4,1,4,2],[0,1,1,23],[3,1,3,2],[9,1,9,2],[10,1,10,2],[7,1,7,2],[8,1,8,2],[5,1,5,2],[6,1,6,2],[13,2,13,6],[13,7,13,8],[11,1,11,2],[12,1,12,3],[16,9,17,10],[50,2,50,5],[40,1,40,2],[46,2,46,5],[47,2,47,5],[48,2,48,5],[49,2,49,5],[40,4,40,5],[24,11,24,13],[25,11,25,13],[26,11,26,13],[27,11,27,13],[18,11,18,13],[19,11,19,13],[20,11,20,13],[21,11,21,13],[22,11,22,13],[38,11,38,13],[17,11,17,13],[16,11,16,13],[13,9,13,12],[33,11,33,13],[34,11,34,13],[35,11,35,13],[36,11,36,13],[37,11,37,13],[28,11,28,13],[29,11,29,13],[30,11,30,13],[31,11,31,13],[32,11,32,13],[23,11,23,13],[18,9,18,10],[19,9,19,10],[20,9,20,10],[21,9,21,10],[22,9,22,10],[23,9,23,10],[24,9,24,10],[25,9,25,10],[26,9,26,10],[27,9,27,10],[28,9,28,10],[29,9,29,10],[30,9,30,10],[31,9,31,10],[32,9,32,10],[33,9,33,10],[34,9,34,10],[35,9,35,10],[36,9,36,10],[37,9,37,10],[38,9,38,10]]}
[null,"HOUSING INCOME"]
[]
[null,"TENANT PAID UTILITY ALLOWANCE"]
[null,"Utility",null,"Utility Type","SRO no Kitchen","SRO with Kitchen","0BR/Eff","1BR","2BR","3BR","4BR","5BR","6BR"]
[null,"Heating"]
[null,"Cooking"]
[null,"Water Heating"]
[null,"Electric"]
[null,"A/C"]
[null,"Water/Sewer"]
[null,"Service Fee"]
[null,"Other"]
[null,"Total Tenant Paid",null,null,{"$f":"SUM(E5:E12)","v":0},0,0,0,0,0,0,{"$f":"SUM(L5:L12)","v":0},{"$f":"SUM(M5:P12)","v":0}]
[null,"Source",null,null,null,null,null,"Effective Date"]
[]
[null,"UNIT / RENT GRID"]
[null,null,null,null,null,null,null,null,null,"Rent Limit",null,null,null,null,"Program Type"]
[null,"Unit Type","# of Bath-rooms","# of Units","Unit\nSq Ft","Monthly Contract Rent","Total Annual Contract Rent","Tenant Paid Utilities","Monthly Gross Rent",null,null,"Income Limit",null,null,"HTC","HOME","NHTF","HPH","PWD","HIB Senior","Rent Asst","Op Subs","Rooms Per Unit","Total Rooms","Source of Rental Assistance or Operating Subsidy"]
[null,null,null,null,null,null,{"$f":"IF(ISBLANK(D19),0,F19*D19*12)","v":0},{"$f":"IF(ISERROR(VLOOKUP(B19,Controls_TenantPaidUtilities, 2, FALSE)),0, VLOOKUP(B19,Controls_TenantPaidUtilities, 2, FALSE))","v":0},{"$f":"F19+H19","v":0},null,null,null,null,null,null,null,null,null,null,null,null,null,{"$f":"Controls_RentGridRoomsPerUnit1","v":""},{"$f":"IF(OR(ISBLANK(W19),ISBLANK(D19)), 0, W19*D19)","v":0}]
[null,null,null,null,null,null,0,0,0,null,null,null,null,null,null,null,null,null,null,null,null,null,{"$f":"Controls_RentGridRoomsPerUnit2","v":""},0]
{"$rows_left_out":33}
{"sheet":"Controls","index":3,"n_rows":51,"n_cols":26,"rows_kept":51,"cut":false,"hidden":true,"merged":[[37,0,38,1],[0,16,0,25],[0,5,0,12],[0,0,0,4],[26,3,26,4],[26,0,26,1],[26,6,26,8],[1,17,1,25]]}
["Unit Information from Rent Grid",null,null,null,null,"Units per Unit Type",null,null,null,null,null,null,null,null,null,null,"HOUSING INCOME"]
["Unit Type","# of Bath-rooms","# of Units","Approx Sq Ft","Monthly Contract Rent","OBR/Eff","SRO no Kitchen","SRO with Kitchen","1BR","2BR","3BR","4BR+","Rooms per Unit",null,null,null,"Market Rent Limit","Checkbox values for Housing Income Rent Grid"]
[{"$f":"INDEX(HousingIncomeUnitRentGridRange,1,1)","v":0},{"$f":"INDEX(HousingIncomeUnitRentGridRange,1,2)","v":0},{"$f":"INDEX(HousingIncomeUnitRentGridRange,1,3)","v":0},{"$f":"INDEX(HousingIncomeUnitRentGridRange,1,4)","v":0},{"$f":"INDEX(HousingIncomeUnitRentGridRange,1,5)","v":0},{"$f":"IF($A3=\"OBR/Eff\",$C3,0)","v":0},{"$f":"IF($A3=\"SRO no Kitchen\",$C3,0)","v":0},{"$f":"IF($A3=\"SRO with Kitchen\",$C3,0)","v":0},{"$f":"IF($A3=\"1BR\",$C3,0)","v":0},{"$f":"IF($A3=\"2BR\",$C3,0)","v":0},{"$f":"IF($A3=\"3BR\",$C3,0)","v":0},{"$f":"IF(OR($A3=\"4BR\",$A3=\"5BR\",$A3=\"6BR\",$A3=\"Bed\"),$C3,0)","v":0},{"$f":"IF(NOT(ISNA(VLOOKUP(A3,Controls_UnitTypeRooms,2,FALSE))),VLOOKUP(A3,Controls_UnitTypeRooms,2,FALSE),\"\")","v":""},null,null,null,"Rent Limit = Market","LIHTC","HOME","NHTF","LTH","PWD","HIB Senior","Op Subs","Rent Asst","Common Space"]
[{"$f":"INDEX(HousingIncomeUnitRentGridRange,2,1)","v":0},{"$f":"INDEX(HousingIncomeUnitRentGridRange,2,2)","v":0},{"$f":"INDEX(HousingIncomeUnitRentGridRange,2,3)","v":0},{"$f":"INDEX(HousingIncomeUnitRentGridRange,2,4)","v":0},{"$f":"INDEX(HousingIncomeUnitRentGridRange,2,5)","v":0},0,0,0,0,0,0,0,"",null,null,null,{"$f":"IF(HousingIncomeRentGridRentLimit1=\"Market\", TRUE,FALSE)","v":false},true,false,false,false,false,false,false,false,false]
[{"$f":"INDEX(HousingIncomeUnitRentGridRange,3,1)","v":0},{"$f":"INDEX(HousingIncomeUnitRentGridRange,3,2)","v":0},{"$f":"INDEX(HousingIncomeUnitRentGridRange,3,3)","v":0},{"$f":"INDEX(HousingIncomeUnitRentGridRange,3,4)","v":0},{"$f":"INDEX(HousingIncomeUnitRentGridRange,3,5)","v":0},0,0,0,0,0,0,0,"",null,null,null,{"$f":"IF(HousingIncomeRentGridRentLimit2=\"Market\", TRUE,FALSE)","v":false},false,false,false,false,false,false,false,false,false]
[{"$f":"INDEX(HousingIncomeUnitRentGridRange,4,1)","v":0},{"$f":"INDEX(HousingIncomeUnitRentGridRange,4,2)","v":0},{"$f":"INDEX(HousingIncomeUnitRentGridRange,4,3)","v":0},{"$f":"INDEX(HousingIncomeUnitRentGridRange,4,4)","v":0},{"$f":"INDEX(HousingIncomeUnitRentGridRange,4,5)","v":0},0,0,0,0,0,0,0,"",null,null,null,{"$f":"IF(HousingIncomeRentGridRentLimit3=\"Market\", TRUE,FALSE)","v":false},false,false,false,false,false,false,false,false,false]
[{"$f":"INDEX(HousingIncomeUnitRentGridRange,5,1)","v":0},{"$f":"INDEX(HousingIncomeUnitRentGridRange,5,2)","v":0},{"$f":"INDEX(HousingIncomeUnitRentGridRange,5,3)","v":0},{"$f":"INDEX(HousingIncomeUnitRentGridRange,5,4)","v":0},{"$f":"INDEX(HousingIncomeUnitRentGridRange,5,5)","v":0},0,0,0,0,0,0,0,"",null,null,null,{"$f":"IF(HousingIncomeRentGridRentLimit4=\"Market\", TRUE,FALSE)","v":false},false,false,false,false,false,false,false,false,false]
[{"$f":"INDEX(HousingIncomeUnitRentGridRange,6,1)","v":0},{"$f":"INDEX(HousingIncomeUnitRentGridRange,6,2)","v":0},{"$f":"INDEX(HousingIncomeUnitRentGridRange,6,3)","v":0},{"$f":"INDEX(HousingIncomeUnitRentGridRange,6,4)","v":0},{"$f":"INDEX(HousingIncomeUnitRentGridRange,6,5)","v":0},0,0,0,0,0,0,0,"",null,null,null,{"$f":"IF(HousingIncomeRentGridRentLimit5=\"Market\", TRUE,FALSE)","v":false},false,false,false,false,false,false,false,false,false]
[{"$f":"INDEX(HousingIncomeUnitRentGridRange,7,1)","v":0},{"$f":"INDEX(HousingIncomeUnitRentGridRange,7,2)","v":0},{"$f":"INDEX(HousingIncomeUnitRentGridRange,7,3)","v":0},{"$f":"INDEX(HousingIncomeUnitRentGridRange,7,4)","v":0},{"$f":"INDEX(HousingIncomeUnitRentGridRange,7,5)","v":0},0,0,0,0,0,0,0,"",null,null,null,{"$f":"IF(HousingIncomeRentGridRentLimit6=\"Market\", TRUE,FALSE)","v":false},false,false,false,false,false,false,false,false,false]
[{"$f":"INDEX(HousingIncomeUnitRentGridRange,8,1)","v":0},{"$f":"INDEX(HousingIncomeUnitRentGridRange,8,2)","v":0},{"$f":"INDEX(HousingIncomeUnitRentGridRange,8,3)","v":0},{"$f":"INDEX(HousingIncomeUnitRentGridRange,8,4)","v":0},{"$f":"INDEX(HousingIncomeUnitRentGridRange,8,5)","v":0},0,0,0,0,0,0,0,"",null,null,null,{"$f":"IF(HousingIncomeRentGridRentLimit7=\"Market\", TRUE,FALSE)","v":false},false,false,false,false,false,false,false,false,false]
[{"$f":"INDEX(HousingIncomeUnitRentGridRange,9,1)","v":0},{"$f":"INDEX(HousingIncomeUnitRentGridRange,9,2)","v":0},{"$f":"INDEX(HousingIncomeUnitRentGridRange,9,3)","v":0},{"$f":"INDEX(HousingIncomeUnitRentGridRange,9,4)","v":0},{"$f":"INDEX(HousingIncomeUnitRentGridRange,9,5)","v":0},0,0,0,0,0,0,0,"",null,null,null,{"$f":"IF(HousingIncomeRentGridRentLimit8=\"Market\", TRUE,FALSE)","v":false},false,false,false,false,false,false,false,false,false]
[{"$f":"INDEX(HousingIncomeUnitRentGridRange,10,1)","v":0},{"$f":"INDEX(HousingIncomeUnitRentGridRange,10,2)","v":0},{"$f":"INDEX(HousingIncomeUnitRentGridRange,10,3)","v":0},{"$f":"INDEX(HousingIncomeUnitRentGridRange,10,4)","v":0},{"$f":"INDEX(HousingIncomeUnitRentGridRange,10,5)","v":0},0,0,0,0,0,0,0,"",null,null,null,{"$f":"IF(HousingIncomeRentGridRentLimit9=\"Market\", TRUE,FALSE)","v":false},false,false,false,false,false,false,false,false,false]
[{"$f":"INDEX(HousingIncomeUnitRentGridRange,11,1)","v":0},{"$f":"INDEX(HousingIncomeUnitRentGridRange,11,2)","v":0},{"$f":"INDEX(HousingIncomeUnitRentGridRange,11,3)","v":0},{"$f":"INDEX(HousingIncomeUnitRentGridRange,11,4)","v":0},{"$f":"INDEX(HousingIncomeUnitRentGridRange,11,5)","v":0},0,0,0,0,0,0,0,"",null,null,null,{"$f":"IF(HousingIncomeRentGridRentLimit10=\"Market\", TRUE,FALSE)","v":false},false,false,false,false,false,false,false,false,false]
[{"$f":"INDEX(HousingIncomeUnitRentGridRange,12,1)","v":0},{"$f":"INDEX(HousingIncomeUnitRentGridRange,12,2)","v":0},{"$f":"INDEX(HousingIncomeUnitRentGridRange,12,3)","v":0},{"$f":"INDEX(HousingIncomeUnitRentGridRange,12,4)","v":0},{"$f":"INDEX(HousingIncomeUnitRentGridRange,12,5)","v":0},0,0,0,0,0,0,0,"",null,null,null,{"$f":"IF(HousingIncomeRentGridRentLimit11=\"Market\", TRUE,FALSE)","v":false},false,false,false,false,false,false,false,false,false]
[{"$f":"INDEX(HousingIncomeUnitRentGridRange,13,1)","v":0},{"$f":"INDEX(HousingIncomeUnitRentGridRange,13,2)","v":0},{"$f":"INDEX(HousingIncomeUnitRentGridRange,13,3)","v":0},{"$f":"INDEX(HousingIncomeUnitRentGridRange,13,4)","v":0},{"$f":"INDEX(HousingIncomeUnitRentGridRange,13,5)","v":0},0,0,0,0,0,0,0,"",null,null,null,{"$f":"IF(HousingIncomeRentGridRentLimit12=\"Market\", TRUE,FALSE)","v":false},false,false,false,false,false,false,false,false,false]
[{"$f":"INDEX(HousingIncomeUnitRentGridRange,14,1)","v":0},{"$f":"INDEX(HousingIncomeUnitRentGridRange,14,2)","v":0},{"$f":"INDEX(HousingIncomeUnitRentGridRange,14,3)","v":0},{"$f":"INDEX(HousingIncomeUnitRentGridRange,14,4)","v":0},{"$f":"INDEX(HousingIncomeUnitRentGridRange,14,5)","v":0},0,0,0,0,0,0,0,"",null,null,null,{"$f":"IF(HousingIncomeRentGridRentLimit13=\"Market\", TRUE,FALSE)","v":false},false,false,false,false,false,false,false,false,false]
[{"$f":"INDEX(HousingIncomeUnitRentGridRange,15,1)","v":0},{"$f":"INDEX(HousingIncomeUnitRentGridRange,15,2)","v":0},{"$f":"INDEX(HousingIncomeUnitRentGridRange,15,3)","v":0},{"$f":"INDEX(HousingIncomeUnitRentGridRange,15,4)","v":0},{"$f":"INDEX(HousingIncomeUnitRentGridRange,15,5)","v":0},0,0,0,0,0,0,0,"",null,null,null,{"$f":"IF(HousingIncomeRentGridRentLimit14=\"Market\", TRUE,FALSE)","v":false},false,false,false,false,false,false,false,false,false]
[{"$f":"INDEX(HousingIncomeUnitRentGridRange,16,1)","v":0},{"$f":"INDEX(HousingIncomeUnitRentGridRange,16,2)","v":0},{"$f":"INDEX(HousingIncomeUnitRentGridRange,16,3)","v":0},{"$f":"INDEX(HousingIncomeUnitRentGridRange,16,4)","v":0},{"$f":"INDEX(HousingIncomeUnitRentGridRange,16,5)","v":0},0,0,0,0,0,0,0,"",null,null,null,{"$f":"IF(HousingIncomeRentGridRentLimit15=\"Market\", TRUE,FALSE)","v":false},false,false,false,false,false,false,false,false,false]
[{"$f":"INDEX(HousingIncomeUnitRentGridRange,17,1)","v":0},{"$f":"INDEX(HousingIncomeUnitRentGridRange,17,2)","v":0},{"$f":"INDEX(HousingIncomeUnitRentGridRange,17,3)","v":0},{"$f":"INDEX(HousingIncomeUnitRentGridRange,17,4)","v":0},{"$f":"INDEX(HousingIncomeUnitRentGridRange,17,5)","v":0},0,0,0,0,0,0,0,"",null,null,null,{"$f":"IF(HousingIncomeRentGridRentLimit16=\"Market\", TRUE,FALSE)","v":false},false,false,false,false,false,false,false,false,false]
[{"$f":"INDEX(HousingIncomeUnitRentGridRange,18,1)","v":0},{"$f":"INDEX(HousingIncomeUnitRentGridRange,18,2)","v":0},{"$f":"INDEX(HousingIncomeUnitRentGridRange,18,3)","v":0},{"$f":"INDEX(HousingIncomeUnitRentGridRange,18,4)","v":0},{"$f":"INDEX(HousingIncomeUnitRentGridRange,18,5)","v":0},0,0,0,0,0,0,0,"",null,null,null,{"$f":"IF(HousingIncomeRentGridRentLimit17=\"Market\", TRUE,FALSE)","v":false},false,false,false,false,false,false,false,false,false]
{"$rows_left_out":32}
{"sheet":"NameRanges","index":4,"n_rows":756,"n_cols":4,"rows_kept":756,"cut":false,"hidden":true,"merged":[]}
["Worksheet Address","Named Range","Scope","Worksheet Address"]
["='Property Information'!R41C9","ckClrControls_PropertyInformationDevelopmentAcquisitionHasBeenAcquiredNoCheckboxValue","2021 RFP Workbook(1).xlsm","$I$41"]
["='Property Information'!R41C8","ckClrControls_PropertyInformationDevelopmentAcquisitionHasBeenAcquiredYesCheckboxValue","2021 RFP Workbook(1).xlsm","$H$41"]
["='Property Information'!R42C9","ckClrControls_PropertyInformationDevelopmentAcquisitionLast3YearsNoCheckboxValue","2021 RFP Workbook(1).xlsm","$I$42"]
["='Property Information'!R42C8","ckClrControls_PropertyInformationDevelopmentAcquisitionLast3YearsYesCheckboxValue","2021 RFP Workbook(1).xlsm","$H$42"]
["='Property Information'!R40C9","ckClrControls_PropertyInformationDevelopmentAcquisitionWillBeAcquiredNoCheckboxValue","2021 RFP Workbook(1).xlsm","$I$40"]
["='Property Information'!R40C8","ckClrControls_PropertyInformationDevelopmentAcquisitionWillBeAcquiredYesCheckboxValue","2021 RFP Workbook(1).xlsm","$H$40"]
["='Housing Income'!R1C1:R53C24","Housing Income'!Print_Area","Housing Income","$A$1:$X$53"]
["='Housing Income'!R14C10","HousingIcomeTenantPaidUtilityAllowanceEffectiveDate","2021 RFP Workbook(1).xlsm","$J$14"]
["='Housing Income'!R44C4","HousingIncomeIncomeAverage","2021 RFP Workbook(1).xlsm","$D$44"]
["='Housing Income'!R41C7","HousingIncomeRentalHousingPotential","2021 RFP Workbook(1).xlsm","$G$41"]
["='Housing Income'!R19C7","HousingIncomeRentGridAnnualContractRent1","2021 RFP Workbook(1).xlsm","$G$19"]
["='Housing Income'!R28C7","HousingIncomeRentGridAnnualContractRent10","2021 RFP Workbook(1).xlsm","$G$28"]
["='Housing Income'!R29C7","HousingIncomeRentGridAnnualContractRent11","2021 RFP Workbook(1).xlsm","$G$29"]
["='Housing Income'!R30C7","HousingIncomeRentGridAnnualContractRent12","2021 RFP Workbook(1).xlsm","$G$30"]
["='Housing Income'!R31C7","HousingIncomeRentGridAnnualContractRent13","2021 RFP Workbook(1).xlsm","$G$31"]
["='Housing Income'!R32C7","HousingIncomeRentGridAnnualContractRent14","2021 RFP Workbook(1).xlsm","$G$32"]
["='Housing Income'!R33C7","HousingIncomeRentGridAnnualContractRent15","2021 RFP Workbook(1).xlsm","$G$33"]
["='Housing Income'!R34C7","HousingIncomeRentGridAnnualContractRent16","2021 RFP Workbook(1).xlsm","$G$34"]
["='Housing Income'!R35C7","HousingIncomeRentGridAnnualContractRent17","2021 RFP Workbook(1).xlsm","$G$35"]
{"$rows_left_out":737}
{"sheet":"Drop Down List Values","index":5,"n_rows":87,"n_cols":13,"rows_kept":87,"cut":false,"hidden":true,"merged":[]}
["Yes","Duplex","Attached Garage","No","MN Hsg Rent Assistance","State","Section 8 HAP Contract","New Construction","Electric","SRO no Kitchen","20% MTSP","20% MTSP","Aitkin"]
["No","Elevator","Detached Garage","Yes, at Imminent Risk of Loss Due to Conversion","MN Hsg Operating Subsidy","Local","Rural Development Rental Assistance","Rehabilitation","Natural Gas","SRO with Kitchen","30% MTSP","30% MTSP","Anoka"]
[null,"Single Family","Underground","Yes, at High Risk Due to Physical Needs","DHS HSASMI Operating Subsidy",null,"PBV Section 8",null,"Oil","0BR/Eff","40% MTSP","40% MTSP","Becker"]
[null,"Townhouse","Ramp","Yes, at High Risk Due to Change in Ownership","Housing Support (fka GRH)",null,"SRO-Mod Rehab PBA",null,"Propane","1BR","50% MTSP","50% MTSP","Beltrami"]
[null,"Walk-up",null,null,"Other",null,"COC Rental Assistance",null,"Steam","2BR","60% MTSP","60% MTSP","Benton"]
[null,"Combination",null,null,null,null,"Emergency Shelter Grant OS",null,null,"3BR","70% MTSP","70% MTSP","Big Stone"]
[null,null,null,null,null,null,"Public Housing reposition Section 18",null,null,"4BR","80% MTSP","80% MTSP","Blue Earth"]
[null,null,null,null,null,null,"Public Housing reposition RAD",null,null,"5BR","30/30 MM","100>S/AMI","Brown"]
[null,null,null,null,null,null,"Public Housing Voluntary Conversion",null,null,"6BR","ALW","30/30 MM","Carlton"]
[null,null,null,null,null,null,"Public Housing Streamlined RAD",null,null,null,"Common Space","80>S/AMI","Carver"]
[null,null,null,null,null,null,"Public Housing RAD Moderate Rehab SRO",null,null,null,"Market","None","Cass"]
[null,null,null,null,null,null,"RAD for PRAC/202",null,null,null,null,null,"Chippewa"]
[null,null,null,null,null,null,"Other",null,null,null,null,null,"Chisago"]
[null,null,null,null,null,null,null,null,null,null,null,null,"Clay"]
[null,null,null,null,null,null,null,null,null,null,null,null,"Clearwater"]
[null,null,null,null,null,null,null,null,null,null,null,null,"Cook"]
[null,null,null,null,null,null,null,null,null,null,null,null,"Cottonwood"]
[null,null,null,null,null,null,null,null,null,null,null,null,"Crow Wing"]
[null,null,null,null,null,null,null,null,null,null,null,null,"Dakota"]
[null,null,null,null,null,null,null,null,null,null,null,null,"Dodge"]
{"$rows_left_out":68}
{"sheet":"Extract Values","index":6,"n_rows":8,"n_cols":2,"rows_kept":8,"cut":false,"hidden":true,"merged":[]}
["Controls_PropertyInformationTribal",{"$f":"IF('Property Information'!B7 = \"Yes\", TRUE, FALSE)","v":false}]
["Controls_PropertyInformationLocatedQualifiedCensusTract",{"$f":"IF('Property Information'!B10 = \"Yes\", TRUE, FALSE)","v":false}]
["Controls_PropertyInformationDevelopmentAcquisitionWillBeAcquiredYesCheckboxValue",{"$f":"IF('Property Information'!C39=\"Yes\",TRUE, FALSE)","v":false}]
["Controls_PropertyInformationDevelopmentAcquisitionHasBeenAcquiredYesCheckboxValue",{"$f":"IF('Property Information'!C40=\"Yes\",TRUE, FALSE)","v":false}]
["Controls_PropertyInformationDevelopmentAcquisitionLast3YearsYesCheckboxValue",{"$f":"IF('Property Information'!C41=\"Yes\",TRUE, FALSE)","v":false}]
["Controls_PropertyInformationDevelopmentAcquisitionWillBeAcquiredNoCheckboxValue",{"$f":"IF('Property Information'!C39=\"No\",TRUE,FALSE)","v":false}]
["Controls_PropertyInformationDevelopmentAcquisitionHasBeenAcquiredNoCheckboxValue",{"$f":"IF('Property Information'!C40=\"No\",TRUE,FALSE)","v":false}]
["Controls_PropertyInformationDevelopmentAcquisitionLast3YearsNoCheckboxValue",{"$f":"IF('Property Information'!C41=\"No\",TRUE,FALSE)","v":false}]