{"text_format":"1","workbook":"xlsx","n_sheets":11,"sheets":["Instructions","Project Description","Unit Mix","Operating Budget","Mortgage Calculation","Development Costs","Sources","Cash Flow","Amortization Schedule","Summary (MHFA Use Only)","DropDownList"],"not_rendered":{"charts":0,"images":0,"macros":0,"external_links":0,"defined_names":134,"comments":4,"pivot_tables":0},"unopened":[],"bounds":{"document_bytes":16777216,"sheet_cells":100000,"rows_first":2000,"rows_last":500,"rows_between":2000,"halvings":0,"cell_chars":16384,"cell_head_chars":4096},"cells_cut":0,"cells_raw":0,"read":"whole","date_system":"1900"}

{"sheet":"Instructions","index":0,"n_rows":18,"n_cols":3,"rows_kept":18,"cut":false,"hidden":false,"merged":[[14,0,14,14],[16,0,16,14],[17,0,17,14],[8,0,8,14],[0,0,0,14],[3,0,3,14],[5,0,5,14],[7,0,7,14],[13,0,13,14]]}
["MINNESOTA HOUSING WORKFORCE HOUSING DEVELOPMENT PROGRAM WORKBOOK INSTRUCTIONS"]
["Workbook Version: March 2026"]
[]
["The current version of the Workforce Housing Development Program (WHDP) Workbook must be used when requesting funding under the WHDP Program at Minnesota Housing. "]
[]
["A completed Workbook along with the required documentation and exhibits comprise a complete application package.  "]
[]
["DATA ENTRY AND VALIDATION"]
["Light blue cells indicate where information is required from the applicant. In some cases, incomplete data entry will result in other required fields being left unpopulated.  "]
[]
[null,null,"Light blue cells indicate where information is required from the applicant."]
[null,null,"White cells indicate standard text or formulas that are locked from editing."]
[]
["CELL COMMENTS/INSTRUCTIONS"]
["Some cells have embedded comments, indicated by a small red triangle in the upper right hand corner. Click or hover over the triangle to see the comments. These comments contain important information related to populating the Workbook and the cell."]
{"$rows_left_out":4}
{"sheet":"Project Description","index":1,"n_rows":32,"n_cols":5,"rows_kept":32,"cut":false,"hidden":false,"merged":[[5,0,5,1],[8,3,8,4],[6,3,6,4],[0,0,0,4],[2,0,2,3],[3,0,3,3],[5,3,5,4]]}
["PROJECT DESCRIPTION"]
[]
["Amount of Workforce Housing Development Program funds being requested",null,null,null,{"$f":"Sources_WorkforceHousingRequestedAmount","v":0}]
["Percentage of Total Development Costs",null,null,null,{"$f":"IFERROR(Sources_WorkforceHousingRequestedAmount/DevCosts_TDC,0)","v":0}]
[]
["Name and Location",null,null,"Activity Type (Select one)"]
["Project Name"]
["Project Address"]
["City",null,null,"Unit Information"]
["Zip Code",null,null,"Will this project contain any income restricted units? (Select one)"]
["County",null,null,"Number of Restricted Units (Enter data on Unit Mix tab)",{"$f":"SUM('Unit Mix'!G6:G26)","v":0}]
[null,null,null,"Number of Market Rate Units (Enter data on Unit Mix tab)",{"$f":"SUM('Unit Mix'!F6:F26)","v":0}]
["Applicant Information",null,null,"Total Number of Units",{"$f":"UnitMix_Summary_UnitCount_Total","v":0}]
["Name of Eligible Recipient Submitting Application"]
["Eligible Recipient Mailing Address",null,null,"Property Information"]
{"$rows_left_out":18}
{"sheet":"Unit Mix","index":2,"n_rows":37,"n_cols":10,"rows_kept":37,"cut":false,"hidden":false,"merged":[[28,5,28,7],[29,5,29,6],[30,5,30,6],[28,0,28,2],[0,0,0,9],[3,0,3,9]]}
["UNIT MIX"]
[]
[]
["Rent Grid"]
["Bedrooms (Select one)","Baths","Number of Units","Square Feet","Monthly Net Rent","Number of Market Rate Units","Number of Income Restricted Units","Annual Net Rent","Number of Rooms Per Unit","Total Rooms"]
[null,null,null,null,null,null,null,{"$f":"C6*E6*12","v":0},{"$f":"IF(A6=\"\", \"0\", _xlfn.IFS(A6=\"studio\", 2.5, VALUE(A6)=1, 3.5, VALUE(A6)=2, 4.5, VALUE(A6)=3, 6, VALUE(A6)=4, 7, VALUE(A6)=5, 8.5))","v":"0"},{"$f":"IFERROR(IF(OR(ISBLANK(I6),ISBLANK(C6)), 0, I6*C6), 0)","v":0}]
[null,null,null,null,null,null,null,0,{"$f":"IF(A7=\"\", \"0\", _xlfn.IFS(A7=\"studio\", 2.5, VALUE(A7)=1, 3.5, VALUE(A7)=2, 4.5, VALUE(A7)=3, 6, VALUE(A7)=4, 7, VALUE(A7)=5, 8.5))","v":"0"},{"$f":"IFERROR(IF(OR(ISBLANK(I7),ISBLANK(C7)), 0, I7*C7), 0)","v":0}]
[null,null,null,null,null,null,null,0,{"$f":"IF(A8=\"\", \"0\", _xlfn.IFS(A8=\"studio\", 2.5, VALUE(A8)=1, 3.5, VALUE(A8)=2, 4.5, VALUE(A8)=3, 6, VALUE(A8)=4, 7, VALUE(A8)=5, 8.5))","v":"0"},0]
[null,null,null,null,null,null,null,0,{"$f":"IF(A9=\"\", \"0\", _xlfn.IFS(A9=\"studio\", 2.5, VALUE(A9)=1, 3.5, VALUE(A9)=2, 4.5, VALUE(A9)=3, 6, VALUE(A9)=4, 7, VALUE(A9)=5, 8.5))","v":"0"},0]
[null,null,null,null,null,null,null,0,{"$f":"IF(A10=\"\", \"0\", _xlfn.IFS(A10=\"studio\", 2.5, VALUE(A10)=1, 3.5, VALUE(A10)=2, 4.5, VALUE(A10)=3, 6, VALUE(A10)=4, 7, VALUE(A10)=5, 8.5))","v":"0"},0]
[null,null,null,null,null,null,null,0,{"$f":"IF(A11=\"\", \"0\", _xlfn.IFS(A11=\"studio\", 2.5, VALUE(A11)=1, 3.5, VALUE(A11)=2, 4.5, VALUE(A11)=3, 6, VALUE(A11)=4, 7, VALUE(A11)=5, 8.5))","v":"0"},0]
[null,null,null,null,null,null,null,0,{"$f":"IF(A12=\"\", \"0\", _xlfn.IFS(A12=\"studio\", 2.5, VALUE(A12)=1, 3.5, VALUE(A12)=2, 4.5, VALUE(A12)=3, 6, VALUE(A12)=4, 7, VALUE(A12)=5, 8.5))","v":"0"},0]
[null,null,null,null,null,null,null,0,{"$f":"IF(A13=\"\", \"0\", _xlfn.IFS(A13=\"studio\", 2.5, VALUE(A13)=1, 3.5, VALUE(A13)=2, 4.5, VALUE(A13)=3, 6, VALUE(A13)=4, 7, VALUE(A13)=5, 8.5))","v":"0"},0]
[null,null,null,null,null,null,null,0,{"$f":"IF(A14=\"\", \"0\", _xlfn.IFS(A14=\"studio\", 2.5, VALUE(A14)=1, 3.5, VALUE(A14)=2, 4.5, VALUE(A14)=3, 6, VALUE(A14)=4, 7, VALUE(A14)=5, 8.5))","v":"0"},0]
[null,null,null,null,null,null,null,0,{"$f":"IF(A15=\"\", \"0\", _xlfn.IFS(A15=\"studio\", 2.5, VALUE(A15)=1, 3.5, VALUE(A15)=2, 4.5, VALUE(A15)=3, 6, VALUE(A15)=4, 7, VALUE(A15)=5, 8.5))","v":"0"},0]
{"$rows_left_out":23}
{"sheet":"Operating Budget","index":3,"n_rows":85,"n_cols":13,"rows_kept":85,"cut":false,"hidden":false,"merged":[[79,12,79,14],[74,12,74,14],[54,12,54,14],[56,12,56,14],[57,12,57,14],[58,12,58,14],[59,12,59,14],[84,1,84,8],[80,1,80,14],[81,1,81,8],[82,1,82,8],[83,1,83,8],[72,1,72,8],[73,1,73,14],[74,1,74,8],[75,1,75,8],[72,12,72,14],[75,12,75,14],[77,12,77,14],[78,12,78,14],[77,2,77,6],[78,2,78,6],[76,1,76,6],[76,8,76,14],[79,1,79,8],[18,1,18,8],[21,1,21,4],[21,5,21,6],[58,1,58,8],[59,1,59,8],[61,1,61,8],[54,1,54,8],[56,1,56,8],[57,1,57,8],[51,1,51,8],[42,1,42,8],[43,1,43,8],[49,1,49,8],[50,1,50,8],[22,5,22,6],[23,3,23,7],[24,3,24,7],[25,1,25,8],[27,1,27,8],[69,12,69,14],[70,12,70,14],[67,12,67,14],[68,12,68,14],[67,1,67,8],[68,1,68,8],[69,1,69,8],[70,1,70,8],[61,12,61,14],[63,12,63,14],[63,1,63,8],[65,12,65,14],[65,1,65,8],[10,1,10,8],[4,1,4,14],[3,1,3,8],[6,12,6,14],[7,12,7,14],[14,1,14,2],[15,1,15,2],[39,1,39,8],[34,2,34,5],[35,1,35,8],[36,1,36,8],[37,1,37,8],[38,1,38,8],[34,12,34,14],[30,1,30,14],[31,1,31,8],[32,1,32,4],[33,2,33,5],[23,1,23,2],[24,1,24,2],[22,1,22,4],[28,1,28,14],[21,12,21,14],[17,1,17,8],[0,1,1,14],[17,12,17,14],[18,12,18,14],[20,1,20,4],[20,5,20,6],[20,12,20,14],[13,12,13,14],[14,3,14,7],[14,12,14,14],[15,3,15,7],[15,12,15,14],[16,12,16,14],[8,12,8,14],[9,4,9,7],[9,12,9,14],[10,12,10,14],[12,12,12,14],[3,12,3,14],[5,12,5,14],[12,1,12,8],[13,1,13,8],[16,1,16,8],[5,1,5,8],[6,1,6,8],[47,12,47,14],[48,12,48,14],[46,12,46,14],[36,12,36,14],[49,12,49,14],[44,12,44,14],[45,12,45,14],[52,1,52,8],[53,1,53,8],[44,1,44,8],[45,1,45,8],[46,1,46,8],[47,1,47,8],[48,1,48,8],[53,12,53,14],[52,12,52,14],[51,12,51,14],[50,12,50,14],[38,12,38,14],[39,12,39,14],[40,12,40,14],[37,12,37,14],[40,1,40,8],[35,12,35,14],[42,12,42,14],[43,12,43,14],[33,12,33,14],[29,1,29,8],[22,12,22,14],[31,12,31,14],[32,12,32,14],[27,12,27,14],[29,12,29,14],[23,12,23,14],[24,12,24,14],[25,12,25,14]]}
[null,"OPERATING BUDGET"]
[]
[]
[null,"INCOME",null,null,null,null,null,null,null,"Total","Per Unit","Per Room","Comments"]
[null,"GROSS POTENTIAL RENT"]
[null,"Rental Housing Potential",null,null,null,null,null,null,null,{"$f":"UnitMix_GrossRentPotential","v":0},{"$f":"IFERROR(J6/UnitMix_Summary_UnitCount_Total,0)","v":0},{"$f":"IFERROR(J6/UnitMix_RentGrid_TotalRooms,0)","v":0}]
[null,"Parking / Garage Rent Potential",null,null,null,null,null,null,null,null,{"$f":"IFERROR(J7/UnitMix_Summary_UnitCount_Total,0)","v":0},{"$f":"IFERROR(J7/UnitMix_RentGrid_TotalRooms,0)","v":0}]
[null,null,"Covered Parking",null,"# of spaces",{"$f":"ProjDesc_Covered_Parking_Spaces","v":0},"Mo Fee",null,null,{"$f":"F8*H8*12","v":0},{"$f":"IFERROR(J8/UnitMix_Summary_UnitCount_Total,0)","v":0},{"$f":"IFERROR(J8/UnitMix_RentGrid_TotalRooms,0)","v":0}]
[null,null,"Surface Parking",null,"# of spaces",{"$f":"ProjDesc_Surface_Parking_Spaces","v":0},"Mo Fee",null,null,{"$f":"F9*H9*12","v":0},0,{"$f":"IFERROR(J9/UnitMix_RentGrid_TotalRooms,0)","v":0}]
[null,"Commercial Rent Potential ",null,null,null,null,null,null,null,null,0,{"$f":"IFERROR(J10/UnitMix_RentGrid_TotalRooms,0)","v":0}]
[null,"Gross Potential Rent",null,null,null,null,null,null,null,{"$f":"SUM(J6:J10)","v":0},{"$f":"SUM(K6:K10)","v":0},0]
[null,"OTHER INCOME FROM OPERATIONS",null,null,null,null,null,null,null,null,0]
[null,"Tenant Fees",null,null,null,null,null,null,null,null,0,{"$f":"IFERROR(J13/UnitMix_RentGrid_TotalRooms,0)","v":0}]
[null,"Laundry Equipment",null,null,null,null,null,null,null,null,0,{"$f":"IFERROR(J14/UnitMix_RentGrid_TotalRooms,0)","v":0}]
[null,"Other  ",null,null,null,null,null,null,null,null,0,0]
{"$rows_left_out":71}
{"sheet":"Mortgage Calculation","index":4,"n_rows":45,"n_cols":13,"rows_kept":45,"cut":false,"hidden":false,"merged":[[9,4,10,4],[16,1,16,3],[0,1,1,10],[4,5,4,7],[6,1,6,3],[9,5,10,5],[9,6,10,6],[9,7,10,7],[9,8,10,8],[9,9,10,9],[9,10,10,10],[11,1,11,3],[12,1,12,3],[13,1,13,3],[14,1,14,3],[15,1,15,3]]}
[null,"MORTGAGE CALCULATION"]
[]
[]
[null,"Income Available for Debt Service"]
[null,null,null,null,null,null,null,null,null,"Year 1","Year 15"]
[null,"Net Operating Income",null,null,null,null,null,null,null,{"$f":"'Cash Flow'!K34","v":0},{"$f":"'Cash Flow'!Y34","v":0}]
[null,"Temporary Income (excluding TIF)"]
[null,"Income Available for Debt Service",null,null,null,null,null,null,null,{"$f":"SUM(J6:J7)","v":0},{"$f":"SUM(K6:K7)","v":0}]
[null,"Subordinated Debt Payments"]
[null,null,null,null,"X' if Minnesota Housing","Principal","Rate","Term (Years)","Amort (Years)","Debt Service\nYear 1","Debt Service\nYear 15"]
[null,"Lender/Loan"]
[null,null,null,null,null,null,null,null,null,{"$f":"IF(F12>0,PMT(G12/12,I12*12,-F12,),)*12","v":0},{"$f":"J12","v":0}]
[null,null,null,null,null,null,null,null,null,0,{"$f":"J13","v":0}]
[null,null,null,null,null,null,null,null,null,0,0]
[null,null,null,null,null,null,null,null,null,0,0]
{"$rows_left_out":31}
{"sheet":"Development Costs","index":5,"n_rows":125,"n_cols":10,"rows_kept":125,"cut":false,"hidden":false,"merged":[[59,3,59,5],[13,3,13,5],[22,3,22,5],[23,3,23,5],[31,3,31,5],[32,3,32,5],[35,4,37,4],[0,1,1,9],[8,1,8,5],[10,3,10,5],[11,3,11,5],[12,3,12,5],[113,1,113,2],[113,4,113,5],[123,3,123,5],[122,3,122,5],[109,1,109,2],[109,4,109,5],[110,1,110,2],[110,4,110,5],[111,1,111,2],[111,4,111,5],[112,1,112,2],[112,4,112,5],[69,3,69,5],[103,3,103,5],[104,3,104,5],[105,3,105,5],[70,3,70,5],[71,3,71,5],[72,3,72,5],[79,3,79,5],[89,3,89,5]]}
[null,"DEVELOPMENT COSTS"]
[]
[]
[null,null,null,null,null,null,null,"Total Costs","Per Unit","Comments"]
[null,"ACQUISITION "]
[null,"Land",null,null,null,null,null,null,{"$f":"IFERROR(H6/UnitMix_Summary_UnitCount_Total,0)","v":0}]
[null,"Existing Structures",null,null,null,null,null,null,0]
[null,"Demolition",null,null,null,null,null,null,0]
[null,"Acquisition/Refinance Subtotal",null,null,null,null,null,{"$f":"SUM(H6:H8)","v":0},0]
[null,"Special Assessments",null,null,null,null,null,null,0]
[null,"Other",null,null,null,null,null,null,0]
[null,"Other",null,null,null,null,null,null,0]
[null,"Holding Costs",null,null,null,null,null,null,0]
[null,"Holding Costs",null,null,null,null,null,null,0]
[null,"Acquisition Total",null,null,null,null,null,{"$f":"SUM(H9:H14)","v":0},{"$f":"SUM(I9:I14)","v":0}]
{"$rows_left_out":111}
{"sheet":"Sources","index":6,"n_rows":90,"n_cols":17,"rows_kept":90,"cut":false,"hidden":false,"merged":[[87,11,87,15],[88,11,88,15],[89,11,89,15],[48,5,48,10],[56,11,56,15],[72,11,72,15],[73,11,73,15],[74,11,74,15],[75,11,75,15],[78,11,78,15],[79,11,79,15],[80,11,80,15],[81,11,81,15],[63,11,63,15],[64,11,64,15],[65,11,65,15],[66,11,66,15],[67,11,67,15],[68,11,68,15],[69,11,69,15],[71,11,71,15],[62,11,62,15],[51,11,51,15],[52,11,52,15],[86,1,86,3],[87,1,87,3],[88,1,88,3],[89,1,89,3],[77,11,77,15],[70,1,70,3],[71,1,71,3],[72,1,72,3],[73,1,73,3],[74,1,74,3],[75,1,75,3],[77,1,77,3],[78,1,78,3],[79,1,79,3],[80,1,80,3],[81,1,81,3],[82,1,82,3],[83,1,83,3],[84,1,84,3],[82,11,82,15],[70,11,70,15],[83,11,83,15],[86,11,86,15],[84,11,84,15],[16,1,16,3],[20,1,20,3],[19,10,19,15],[20,10,20,15],[21,10,21,15],[15,1,15,3],[0,1,1,15],[3,1,3,15],[4,1,4,3],[4,9,4,15],[5,1,5,3],[5,9,5,15],[6,1,6,3],[6,9,6,15],[7,1,7,3],[7,9,7,15],[66,1,66,3],[67,1,67,3],[55,1,55,3],[68,1,68,3],[58,1,58,3],[60,1,60,3],[61,1,61,3],[8,1,8,3],[8,9,8,15],[22,1,22,3],[18,1,18,3],[19,1,19,3],[9,1,9,3],[9,9,9,15],[12,1,12,15],[13,1,13,3],[13,10,13,15],[14,10,14,15],[15,10,15,15],[16,10,16,15],[17,10,17,15],[18,10,18,15],[14,1,14,3],[17,1,17,3],[26,1,26,3],[21,1,21,3],[27,1,27,3],[58,11,58,15],[28,1,28,3],[23,1,23,3],[24,1,24,3],[25,1,25,3],[22,10,22,15],[23,10,23,15],[24,10,24,15],[25,10,25,15],[26,10,26,15],[27,10,27,15],[28,10,28,15],[29,10,29,15],[49,11,49,15],[49,1,49,3],[50,1,50,3],[51,1,51,3],[52,1,52,3],[33,1,33,15],[34,10,34,15],[35,10,35,15],[69,1,69,3],[29,1,29,3],[31,1,31,3],[47,1,47,15],[59,1,59,3],[61,11,61,15],[60,11,60,15],[56,1,56,3],[57,1,57,3],[37,10,37,15],[55,11,55,15],[57,11,57,15],[59,11,59,15],[36,10,36,15],[38,10,38,15],[42,10,42,15],[53,11,53,15],[54,11,54,15],[53,1,53,3],[54,1,54,3],[62,1,62,3],[63,1,63,3],[64,1,64,3],[65,1,65,3],[43,1,43,3],[44,1,44,3],[39,10,39,15],[40,10,40,15],[41,10,41,15],[45,1,45,3],[34,1,34,3],[35,1,35,3],[36,1,36,3],[37,1,37,3],[38,1,38,3],[39,1,39,3],[40,1,40,3],[41,1,41,3],[42,1,42,3],[34,4,34,6],[35,4,35,6],[36,4,36,6],[37,4,37,6],[38,4,38,6],[39,4,39,6],[40,4,40,6],[41,4,41,6],[42,4,42,6]]}
[null,"SOURCES"]
[]
[]
[null,"INTERIM SOURCES (do not include perm sources to be used during construction in this table)"]
[null,"Name of Source",null,null,"Term","Rate","Amount","Per Unit","Committed","Comments"]
[null,null,null,null,null,null,null,{"$f":"IFERROR(G6/UnitMix_Summary_UnitCount_Total,0)","v":0}]
[null,null,null,null,null,null,null,0]
[null,null,null,null,null,null,null,0]
[null,null,null,null,null,null,null,0]
[null,null,null,null,null,null,null,0]
[null,"Total Interim Financing",null,null,null,null,{"$f":"SUM(G6:G10)","v":0},0]
[]
[null,"PERMANENT SOURCES"]
[null,"Name of Source",null,null,"Term","Rate","Amount","Per Unit","Committed","End Loan","Comments"]
[null,"First Mortgage",null,null,{"$f":"'Mortgage Calculation'!K25","v":0},{"$f":"'Mortgage Calculation'!K27","v":0},{"$f":"IF(ISBLANK('Mortgage Calculation'!K32),'Mortgage Calculation'!K31,'Mortgage Calculation'!K32)+IF('Mortgage Calculation'!K45=\"x\",IF(ISBLANK('Mortgage Calculation'!K44),'Mortgage Calculation'!K43,'Mortgage Calculation'!K44),0)","v":0},{"$f":"IFERROR(G15/UnitMix_Summary_UnitCount_Total,0)","v":0}]
{"$rows_left_out":76}
{"sheet":"Cash Flow","index":7,"n_rows":67,"n_cols":40,"rows_kept":67,"cut":false,"hidden":false,"merged":[[65,1,65,6],[54,1,54,4],[55,1,55,4],[58,1,58,4],[61,1,61,4],[59,1,59,5],[62,1,62,4],[4,25,4,39],[39,1,39,5],[5,1,5,5],[19,2,19,4],[20,2,20,4],[23,1,23,5],[36,1,36,4],[38,1,38,5],[4,10,4,24],[12,2,12,4],[13,2,13,4],[14,2,14,4],[0,1,1,24],[3,9,3,10],[40,1,40,5],[53,1,53,4],[46,1,46,5],[49,1,49,4],[50,1,50,4],[52,1,52,4],[41,1,41,5],[42,1,42,5],[43,1,43,5],[44,1,44,5],[45,1,45,5],[47,2,47,5],[48,2,48,5]]}
[null,"CASH FLOW"]
[]
[]
[]
[null,null,null,null,null,null,null,null,null,null,"Year",null,null,null,null,null,null,null,null,null,null,null,null,null,null,"Year"]
[null,null,null,null,null,null,"Inflator","Actuals Two Years Ago","Actuals One Year Ago","Actuals Current Year",1,2,3,4,5,6,7,8,9,10,11,12,13,14,15,16,17,18,19,20,21,22,23,24,25,26,27,28,29,30]
[null,"INCOME"]
[null,"Rental Income",null,null,null,null,0.02,null,null,null,{"$f":"'Operating Budget'!J6","v":0},{"$f":"K8*(1+$G8)","v":0},{"$f":"L8*(1+$G8)","v":0},0,0,0,0,0,0,0,0,0,0,0,0,{"$f":"Y8*(1+$G8)","v":0},{"$f":"Z8*(1+$G8)","v":0},{"$f":"AA8*(1+$G8)","v":0},{"$f":"AB8*(1+$G8)","v":0},{"$f":"AC8*(1+$G8)","v":0},{"$f":"AD8*(1+$G8)","v":0},{"$f":"AE8*(1+$G8)","v":0},{"$f":"AF8*(1+$G8)","v":0},{"$f":"AG8*(1+$G8)","v":0},{"$f":"AH8*(1+$G8)","v":0},{"$f":"AI8*(1+$G8)","v":0},{"$f":"AJ8*(1+$G8)","v":0},{"$f":"AK8*(1+$G8)","v":0},{"$f":"AL8*(1+$G8)","v":0},{"$f":"AM8*(1+$G8)","v":0}]
[null,"Parking Income",null,null,null,null,0.02,null,null,null,{"$f":"'Operating Budget'!J8+'Operating Budget'!J9","v":0},{"$f":"K9*(1+$G9)","v":0},0,0,0,0,0,0,0,0,0,0,0,0,0,0,0,0,0,0,0,0,0,0,0,0,0,0,0,0]
[null,"Commercial Income",null,null,null,null,0.02,null,null,null,{"$f":"'Operating Budget'!J10","v":0},{"$f":"K10*(1+$G10)","v":0},0,0,0,0,0,0,0,0,0,0,0,0,0,0,0,0,0,0,0,0,0,0,0,0,0,0,0,0]
[null,"Gross Potential Rent",null,null,null,null,null,{"$f":"SUM(H8:H10)","v":0},{"$f":"SUM(I8:I10)","v":0},0,0,0,0,0,0,0,0,0,0,0,0,0,0,0,0,{"$f":"SUM(Z8:Z10)","v":0},0,0,0,0,0,0,0,0,0,0,0,0,0,0]
[null,"Other Income from Operations",null,null,null,null,0.02,null,null,null,{"$f":"'Operating Budget'!J19","v":0},{"$f":"K12*(1+$G12)","v":0},0,0,0,0,0,0,0,0,0,0,0,0,0,{"$f":"Y12*(1+$G12)","v":0},{"$f":"Z12*(1+$G12)","v":0},{"$f":"AA12*(1+$G12)","v":0},{"$f":"AB12*(1+$G12)","v":0},{"$f":"AC12*(1+$G12)","v":0},{"$f":"AD12*(1+$G12)","v":0},{"$f":"AE12*(1+$G12)","v":0},{"$f":"AF12*(1+$G12)","v":0},{"$f":"AG12*(1+$G12)","v":0},{"$f":"AH12*(1+$G12)","v":0},{"$f":"AI12*(1+$G12)","v":0},{"$f":"AJ12*(1+$G12)","v":0},{"$f":"AK12*(1+$G12)","v":0},{"$f":"AL12*(1+$G12)","v":0},{"$f":"AM12*(1+$G12)","v":0}]
[null,"  Other "]
[null,"  Other"]
[null,"  Other"]
{"$rows_left_out":53}
{"sheet":"Amortization Schedule","index":8,"n_rows":489,"n_cols":19,"rows_kept":489,"cut":false,"hidden":false,"merged":[[1,0,1,2],[1,9,1,11],[2,0,2,2],[2,9,2,11],[3,0,3,2],[3,9,3,11],[4,0,4,2],[4,9,4,11],[5,0,5,2],[5,9,5,11],[6,0,6,2],[6,9,6,11]]}
["AMORTIZATION SCHEDULE - NOI SUPPORTED DEBT",null,null,null,null,null,null,null,null,"AMORTIZATION SCHEDULE - TIF SUPPORTED DEBT"]
["Loan amount",null,null,{"$f":"IF('Mortgage Calculation'!K32>0,'Mortgage Calculation'!K32,'Mortgage Calculation'!K31)","v":0},null,null,null,null,null,"Loan amount",null,null,{"$f":"IF('Mortgage Calculation'!K44>0,'Mortgage Calculation'!K44,'Mortgage Calculation'!K43)","v":0}]
["Annual Interest Rate",null,null,{"$f":"'Mortgage Calculation'!K27","v":0},null,null,null,null,null,"Annual Interest Rate",null,null,{"$f":"'Mortgage Calculation'!K39","v":0}]
["MIP Rate",null,null,{"$f":"'Mortgage Calculation'!K28","v":0},null,null,null,null,null,"MIP Rate",null,null,{"$f":"'Mortgage Calculation'!K40","v":0}]
["Amortization",null,null,{"$f":"'Mortgage Calculation'!K26","v":0},null,null,null,null,null,"Amortization",null,null,{"$f":"'Mortgage Calculation'!K38","v":0}]
["Payments per Year",null,null,12,null,null,null,null,null,"Payments per Year",null,null,12]
["Monthly Payment",null,null,{"$f":"IF(D2>0,PMT(D3/D6,D5*D6,-D2,),)","v":0},null,null,null,null,null,"Monthly Payment",null,null,{"$f":"IF(M2>0,PMT(M3/M6,M5*M6,-M2,),)","v":0}]
[]
["Year","Payment #","Beginning Balance","Interest","Principal","Ending Balance","Average Ending Balance","MIP",null,"Year","Payment #","Beginning Balance","Interest","Principal","Ending Balance","Average Ending Balance","MIP",null,"Total MIP"]
[1,1,{"$f":"D2","v":0},{"$f":"C10*$D$3/12","v":0},{"$f":"IF(ROUND(C10,2)>0,$D$7-D10,0)","v":0},{"$f":"C10-E10","v":0},{"$f":"AVERAGE(F10:F21)","v":0},{"$f":"G10*$D$4","v":0},null,1,1,{"$f":"M2","v":0},{"$f":"L10*$M$3/12","v":0},{"$f":"IF(ROUND(L10,2)>0,$M$7-M10,0)","v":0},{"$f":"L10-N10","v":0},{"$f":"AVERAGE(O10:O21)","v":0},{"$f":"P10*$M$4","v":0},null,{"$f":"H10+Q10","v":0}]
[null,2,{"$f":"F10","v":0},{"$f":"C11*$D$3/12","v":0},{"$f":"IF(ROUND(C11,2)>0,$D$7-D11,0)","v":0},{"$f":"C11-E11","v":0},null,null,null,null,2,{"$f":"O10","v":0},{"$f":"L11*$M$3/12","v":0},{"$f":"IF(ROUND(L11,2)>0,$M$7-M11,0)","v":0},{"$f":"L11-N11","v":0}]
[null,3,{"$f":"F11","v":0},{"$f":"C12*$D$3/12","v":0},0,{"$f":"C12-E12","v":0},null,null,null,null,3,{"$f":"O11","v":0},0,0,{"$f":"L12-N12","v":0}]
[null,4,0,0,0,0,null,null,null,null,4,0,0,0,0]
[null,5,0,0,0,0,null,null,null,null,5,0,0,0,0]
[null,6,0,0,0,0,null,null,null,null,6,0,0,0,0]
{"$rows_left_out":475}
{"sheet":"Summary (MHFA Use Only)","index":9,"n_rows":96,"n_cols":6,"rows_kept":96,"cut":false,"hidden":false,"merged":[[2,1,2,5],[3,1,3,5],[4,1,4,5],[5,1,5,5],[6,1,6,5],[65,0,65,1],[85,0,85,1],[39,0,39,4],[9,0,9,4],[63,0,63,4],[15,1,15,5],[14,1,14,5],[65,3,65,5],[10,1,10,5],[11,1,11,5],[12,1,12,5],[13,1,13,5]]}
["Project Summary"]
[]
["Property Number (D#)"]
["Project Number (M#)"]
["Project Name",{"$f":"ProjDesc_ProjectName","v":0}]
["City",{"$f":"ProjDesc_City","v":0}]
["Activity Type",{"$f":"ProjDesc_ActivityType_Response","v":0}]
[]
["Development Team"]
[]
["Eligible Recipient Submitting Application",{"$f":"ProjDesc_EligibleRecipient","v":0}]
["Developer",{"$f":"ProjDesc_Developer","v":0}]
["General Contractor",{"$f":"ProjDesc_GeneralContractor","v":0}]
["Architect",{"$f":"ProjDesc_Architect","v":0}]
["Management Company",{"$f":"ProjDesc_ManagementCompany","v":0}]
{"$rows_left_out":82}
{"sheet":"DropDownList","index":10,"n_rows":8,"n_cols":9,"rows_kept":8,"cut":false,"hidden":true,"merged":[]}
["Yes/No","Activity Type","Funding Request Type","Building Type","Covered Parking Type","Unit Mix_Bedrooms","Match Type","Match Source Organization","Region"]
["Yes","Conversion/Adaptive ReUse","Grant","Duplex","Attached Garage","Studio","Capital","Local Unit of Government","Central"]
["No","New Construction","Deferred Loan","Elevator","Detatched Garage",1,"Non-Capital","Business","Northeast"]
[null,"Other (explain in narrative)",null,"Single Family","Underground",2,null,"Nonprofit Organization","Northwest"]
[null,null,null,"Townhouse","Ramp",3,null,"Federally Recognized Tribe","Southeast"]
[null,null,null,"Walk-Up",null,4,null,"Other (Describe in Comments)","Southwest"]
[null,null,null,"Combination ",null,5,null,null,"West Central"]
[null,null,null,"Other"]